Target
5-hydroxytryptamine receptor 1A
Ligand
BDBM50030490
Substrate
Meas. Tech.
ChEMBL_1435677 (CHEMBL3387738)
Ki
285±n/a nM
Citation
 Li, ZHuang, JSun, HZhou, SGuo, LZhou, YZhen, XLiu, H Design, synthesis and evaluation of benzo[a]thieno[3,2-g]quinolizines as novel l-SPD derivatives possessing dopamine D1, D2 and serotonin 5-HT1A multiple action profiles. Bioorg Med Chem 22:5838-46 (2014)  
Target
Name:
5-hydroxytryptamine receptor 1A
Synonyms:
5-HT-1A 5-hydroxytryptamine receptor 1A (5-HT-1A) ADRB2RL1 Dopamine D2 receptor and serotonin 1a receptor HTR1A | Serotonin receptor 1A
Type:
Mol. Mass.:
46122.49
Organism:
Homo sapiens (Human)
Description:
Residue:
422
  
Inhibitor
Name:
BDBM50030490
Synonyms:
CHEMBL3344469
Type:
Small organic molecule
Emp. Form.:
C19H22ClNO2S
Mol. Mass.:
363.901
SMILES:
[H][C@@]12Cc3sc(CC(C)Cl)cc3CN1CCc1cc(OC)c(O)cc21
: