Target
Casein kinase I isoform delta
Ligand
BDBM50030881
Substrate
Meas. Tech.
ChEMBL_1441595 (CHEMBL3376475)
IC50
>30000±n/a nM
Citation
 Deng, YShipps, GWCooper, AEnglish, JMAnnis, DACarr, DNan, YWang, TZhu, HYChuang, CCDayananth, PHruza, AWXiao, LJin, WKirschmeier, PWindsor, WTSamatar, AA Discovery of novel, dual mechanism ERK inhibitors by affinity selection screening of an inactive kinase. J Med Chem 57:8817-26 (2014)  
Target
Name:
Casein kinase I isoform delta
Synonyms:
CKI-delta CSNK1D Casein kinase I delta Casein kinase I isoform delta (CK1D) KC1D_HUMAN | casein kinases 1 delta (CK1 delta)
Type:
Enzyme
Mol. Mass.:
47356.76
Organism:
Homo sapiens (Human)
Description:
P48730
Residue:
415
  
Inhibitor
Name:
BDBM50030881
Synonyms:
CHEMBL3356117
Type:
Small organic molecule
Emp. Form.:
C25H29ClN4O4
Mol. Mass.:
484.975
SMILES:
CC(=O)c1ccc(cc1)N1CCN(CC1)C(=O)CN1CC[C@H](C1)C(=O)Nc1ccc(O)c(Cl)c1
: