Target
Dual specificity mitogen-activated protein kinase kinase 1
Ligand
BDBM50030881
Substrate
Meas. Tech.
ChEMBL_1441613 (CHEMBL3377059)
IC50
>20000±n/a nM
Citation
 Deng, YShipps, GWCooper, AEnglish, JMAnnis, DACarr, DNan, YWang, TZhu, HYChuang, CCDayananth, PHruza, AWXiao, LJin, WKirschmeier, PWindsor, WTSamatar, AA Discovery of novel, dual mechanism ERK inhibitors by affinity selection screening of an inactive kinase. J Med Chem 57:8817-26 (2014)  
Target
Name:
Dual specificity mitogen-activated protein kinase kinase 1
Synonyms:
Dual specificity mitogen-activated protein kinase (MEK) Dual specificity mitogen-activated protein kinase kinase 1 (MEK1) Dual specificity mitogen-activated protein kinase kinase MEK1/2 MAP kinase kinase 1 MAPK/ERK kinase 1 MEK-1 MP2K1_HUMAN PRKMK1 | VHL-MAP2K1/MAP2K2
Type:
Other Protein Type
Mol. Mass.:
43439.03
Organism:
Homo sapiens (Human)
Description:
Full-length human MEK-1 was generated by PCR and purified as a fusion protein from Escherichia coli lysates.
Residue:
393
  
Inhibitor
Name:
BDBM50030881
Synonyms:
CHEMBL3356117
Type:
Small organic molecule
Emp. Form.:
C25H29ClN4O4
Mol. Mass.:
484.975
SMILES:
CC(=O)c1ccc(cc1)N1CCN(CC1)C(=O)CN1CC[C@H](C1)C(=O)Nc1ccc(O)c(Cl)c1
: