Target
Group 10 secretory phospholipase A2
Ligand
BDBM50262998
Substrate
Meas. Tech.
ChEMBL_1442448 (CHEMBL3380078)
IC50
7.0±n/a nM
Citation
 Chen, HKnerr, LÅkerud, THallberg, KÖster, LRohman, MÖsterlund, KBeisel, HGOlsson, TBrengdhal, JSandmark, JBodin, C Discovery of a novel pyrazole series of group X secreted phospholipase A2 inhibitor (sPLA2X) via fragment based virtual screening. Bioorg Med Chem Lett 24:5251-5 (2014)  
Target
Name:
Group 10 secretory phospholipase A2
Synonyms:
Group X secretory phospholipase A2 PLA2G10
Type:
PROTEIN
Mol. Mass.:
18153.11
Organism:
Homo sapiens (Human)
Description:
ChEMBL_1442449
Residue:
165
  
Inhibitor
Name:
BDBM50262998
Synonyms:
CHEMBL477548 | mesyl-2-(3-(2-amino-2-oxoacetyl)-1-benzyl-2-isobutyl-1H-indol-4-yloxy)acetamide
Type:
Small organic molecule
Emp. Form.:
C24H27N3O6S
Mol. Mass.:
485.553
SMILES:
CC(C)Cc1c(C(=O)C(N)=O)c2c(OCC(=O)NS(C)(=O)=O)cccc2n1Cc1ccccc1
: