Target
Histone-lysine N-methyltransferase SUV39H1
Ligand
BDBM50031317
Substrate
Meas. Tech.
ChEMBL_1436394 (CHEMBL3389597)
IC50
>150000±n/a nM
Citation
 Chen, SWang, YZhou, WLi, SPeng, JShi, ZHu, JLiu, YCDing, HLin, YLi, LCheng, SLiu, JLu, TJiang, HLiu, BZheng, MLuo, C Identifying novel selective non-nucleoside DNA methyltransferase 1 inhibitors through docking-based virtual screening. J Med Chem 57:9028-41 (2014)  
Target
Name:
Histone-lysine N-methyltransferase SUV39H1
Synonyms:
H3-K9-HMTase 1 KMT1A Position-effect variegation 3-9 homolog SUV39H1 Su(var)3-9 homolog 1 | Suppressor of variegation 3-9 homolog 1
Type:
PROTEIN
Mol. Mass.:
47917.07
Organism:
Homo sapiens (Human)
Description:
ChEMBL_1473655
Residue:
412
  
Inhibitor
Name:
BDBM50031317
Synonyms:
CHEMBL3358015
Type:
Small organic molecule
Emp. Form.:
C25H25N3O
Mol. Mass.:
383.4855
SMILES:
OC(CNCCc1c[nH]c2ccccc12)Cn1c2ccccc2c2ccccc12
: