Target
Peptidase 1
Ligand
BDBM50031688
Substrate
Meas. Tech.
ChEMBL_1443313 (CHEMBL3374743)
IC50
3.0±n/a nM
Citation
 Newton, GKPerrior, TRJenkins, KMajor, MRKey, REStewart, MRFirth-Clark, SLloyd, SMZhang, JFrancis-Newton, NJRichardson, JPChen, JLai, PGarrod, DRRobinson, C The discovery of potent, selective, and reversible inhibitors of the house dust mite peptidase allergen Der p 1: an innovative approach to the treatment of allergic asthma. J Med Chem 57:9447-62 (2014)  
Target
Name:
Peptidase 1
Synonyms:
DERP1 Peptidase 1 (Der p 1)
Type:
Enzyme
Mol. Mass.:
36101.04
Organism:
Dermatophagoides pteronyssinus (European house dust mite)
Description:
P08176
Residue:
320
  
Inhibitor
Name:
BDBM50031688
Synonyms:
CHEMBL3360299
Type:
Small organic molecule
Emp. Form.:
C30H39N5O7S
Mol. Mass.:
613.725
SMILES:
CC(C)[C@H](NC(=O)[C@H](C)NC(=O)[C@@H](N1Cc2ccccc2C1=O)C(C)(C)C)C(=O)C(=O)NCc1ccc(cc1)S(N)(=O)=O
: