Target
Peptidase 1
Ligand
BDBM50031634
Substrate
Meas. Tech.
ChEMBL_1443313 (CHEMBL3374743)
IC50
55±n/a nM
Citation
 Newton, GKPerrior, TRJenkins, KMajor, MRKey, REStewart, MRFirth-Clark, SLloyd, SMZhang, JFrancis-Newton, NJRichardson, JPChen, JLai, PGarrod, DRRobinson, C The discovery of potent, selective, and reversible inhibitors of the house dust mite peptidase allergen Der p 1: an innovative approach to the treatment of allergic asthma. J Med Chem 57:9447-62 (2014)  
Target
Name:
Peptidase 1
Synonyms:
DERP1 Peptidase 1 (Der p 1)
Type:
Enzyme
Mol. Mass.:
36101.04
Organism:
Dermatophagoides pteronyssinus (European house dust mite)
Description:
P08176
Residue:
320
  
Inhibitor
Name:
BDBM50031634
Synonyms:
CHEMBL3359787
Type:
Small organic molecule
Emp. Form.:
C30H38N4O6
Mol. Mass.:
550.6459
SMILES:
CC(C)C(NC(=O)[C@H](C)NC(=O)[C@H](Cc1ccccc1)NC(=O)c1ccccc1)C(=O)C(=O)NC1CCOCC1
: