Target
Peptidase 1
Ligand
BDBM50031717
Substrate
Meas. Tech.
ChEMBL_1443313 (CHEMBL3374743)
IC50
67±n/a nM
Citation
 Newton, GKPerrior, TRJenkins, KMajor, MRKey, REStewart, MRFirth-Clark, SLloyd, SMZhang, JFrancis-Newton, NJRichardson, JPChen, JLai, PGarrod, DRRobinson, C The discovery of potent, selective, and reversible inhibitors of the house dust mite peptidase allergen Der p 1: an innovative approach to the treatment of allergic asthma. J Med Chem 57:9447-62 (2014)  
Target
Name:
Peptidase 1
Synonyms:
DERP1 Peptidase 1 (Der p 1)
Type:
Enzyme
Mol. Mass.:
36101.04
Organism:
Dermatophagoides pteronyssinus (European house dust mite)
Description:
P08176
Residue:
320
  
Inhibitor
Name:
BDBM50031717
Synonyms:
CHEMBL3359784
Type:
Small organic molecule
Emp. Form.:
C28H40N6O5
Mol. Mass.:
540.6544
SMILES:
CC(C)C(NC(=O)[C@H](C)NC(=O)[C@@H](NC(=O)c1c(C)n[nH]c1C)C(C)(C)C)C(=O)C(=O)NCc1ccccc1
: