Target
Peptidase 1
Ligand
BDBM50031680
Substrate
Meas. Tech.
ChEMBL_1443313 (CHEMBL3374743)
IC50
164±n/a nM
Citation
 Newton, GKPerrior, TRJenkins, KMajor, MRKey, REStewart, MRFirth-Clark, SLloyd, SMZhang, JFrancis-Newton, NJRichardson, JPChen, JLai, PGarrod, DRRobinson, C The discovery of potent, selective, and reversible inhibitors of the house dust mite peptidase allergen Der p 1: an innovative approach to the treatment of allergic asthma. J Med Chem 57:9447-62 (2014)  
Target
Name:
Peptidase 1
Synonyms:
DERP1 Peptidase 1 (Der p 1)
Type:
Enzyme
Mol. Mass.:
36101.04
Organism:
Dermatophagoides pteronyssinus (European house dust mite)
Description:
P08176
Residue:
320
  
Inhibitor
Name:
BDBM50031680
Synonyms:
CHEMBL3359778
Type:
Small organic molecule
Emp. Form.:
C33H44N4O5
Mol. Mass.:
576.7263
SMILES:
CCC[C@H](NC(=O)[C@H](Cc1ccccc1)NC(=O)c1ccccc1)C(=O)N[C@@H](C(C)C)C(=O)C(=O)NC1CCCCC1
: