Target
Neutrophil elastase
Ligand
BDBM50032887
Substrate
Meas. Tech.
ChEMBL_1431795 (CHEMBL3385091)
IC50
2.4±n/a nM
Citation
 Abdel-Magid, AF Neutrophil elastase inhibitors as potential anti-inflammatory therapies. ACS Med Chem Lett 5:1182-3 (2014)  
Target
Name:
Neutrophil elastase
Synonyms:
Bone marrow serine protease Coagulation factor X ELANE Elastase HLE Leukocyte elastase Medullasin Neutrophil elastase (HNE) PMN elastase Trypsin
Type:
Enzyme
Mol. Mass.:
28532.38
Organism:
Homo sapiens (Human)
Description:
P08246
Residue:
267
  
Inhibitor
Name:
BDBM50032887
Synonyms:
CHEMBL3342777 US9670166, 2
Type:
Small organic molecule
Emp. Form.:
C22H16F3N3O2
Mol. Mass.:
411.3765
SMILES:
CN1C(C2=C(CCC2=O)N(C1=O)c1cccc(c1)C(F)(F)F)c1ccc(cc1)C#N
: