Target
Cytochrome P450 2C19
Ligand
BDBM50033374
Substrate
Meas. Tech.
ChEMBL_1434293 (CHEMBL3385838)
IC50
>10000±n/a nM
Citation
 Xia, GChen, WZhang, JShao, JZhang, YHuang, WZhang, LQi, WSun, XLi, BXiang, ZMa, CXu, JDeng, HLi, YLi, PMiao, HHan, JLiu, YShen, JYu, Y A chemical tuned strategy to develop novel irreversible EGFR-TK inhibitors with improved safety and pharmacokinetic profiles. J Med Chem 57:9889-900 (2014)  
Target
Name:
Cytochrome P450 2C19
Synonyms:
(R)-limonene 6-monooxygenase (S)-limonene 7-monooxygenase CYP2C19 CYPIIC19 Cytochrome P450 2C19 [I331V] Cytochrome P450-254C Mephenytoin 4-hydroxylase P450-254C
Type:
Enzyme
Mol. Mass.:
55935.47
Organism:
Homo sapiens (Human)
Description:
P33261
Residue:
490
  
Inhibitor
Name:
BDBM50033374
Synonyms:
CHEMBL3357637
Type:
Small organic molecule
Emp. Form.:
C28H28ClFN6O3
Mol. Mass.:
551.012
SMILES:
CCOc1cc2ncnc(Nc3ccc(OCc4ccccn4)c(Cl)c3)c2cc1NC(=O)C(\F)=C\CN(C)C
: