Target
Tyrosine-protein kinase JAK2
Ligand
BDBM50033376
Substrate
Meas. Tech.
ChEMBL_1433621 (CHEMBL3385200)
IC50
>10000±n/a nM
Citation
 Xia, GChen, WZhang, JShao, JZhang, YHuang, WZhang, LQi, WSun, XLi, BXiang, ZMa, CXu, JDeng, HLi, YLi, PMiao, HHan, JLiu, YShen, JYu, Y A chemical tuned strategy to develop novel irreversible EGFR-TK inhibitors with improved safety and pharmacokinetic profiles. J Med Chem 57:9889-900 (2014)  
Target
Name:
Tyrosine-protein kinase JAK2
Synonyms:
JAK-2 JAK2_HUMAN Janus kinase 2 (JAK2) | Janus kinase 2 (a protein tyrosine kinase)
Type:
Protein
Mol. Mass.:
130684.68
Organism:
Homo sapiens (Human)
Description:
O60674
Residue:
1132
  
Inhibitor
Name:
BDBM50033376
Synonyms:
CHEMBL3357634
Type:
Small organic molecule
Emp. Form.:
C21H20ClF2N5O2
Mol. Mass.:
447.866
SMILES:
COc1cc2ncnc(Nc3ccc(F)c(Cl)c3)c2cc1NC(=O)C(\F)=C\CN(C)C
: