Target
5-hydroxytryptamine receptor 7
Ligand
BDBM50034799
Substrate
Meas. Tech.
ChEMBL_1441769 (CHEMBL3378892)
Ki
131±n/a nM
Citation
 Partyka, AChlon-Rzepa, GWasik, AJastrzebska-Wiesek, MBucki, AKolaczkowski, MSatala, GBojarski, AJWesolowska, A Antidepressant- and anxiolytic-like activity of 7-phenylpiperazinylalkyl-1,3-dimethyl-purine-2,6-dione derivatives with diversified 5-HT1A receptor functional profile. Bioorg Med Chem 23:212-21 (2014)  
Target
Name:
5-hydroxytryptamine receptor 7
Synonyms:
5-HT-7 5-HT7 5-HT7S 5HT7 HTR7 | Serotonin receptor 7
Type:
G Protein-Coupled Receptor (GPCR)
Mol. Mass.:
53573.08
Organism:
Homo sapiens (Human)
Description:
P34969
Residue:
479
  
Inhibitor
Name:
BDBM50034799
Synonyms:
CHEMBL3361001
Type:
Small organic molecule
Emp. Form.:
C22H30Cl2N6O2
Mol. Mass.:
481.419
SMILES:
Cl.Cn1c2ncn(CCCCCN3CCN(CC3)c3cccc(Cl)c3)c2c(=O)n(C)c1=O
: