Target
Hepatocyte growth factor receptor
Ligand
BDBM50035417
Substrate
Meas. Tech.
ChEMBL_1432749 (CHEMBL3381417)
IC50
2.4±n/a nM
Citation
 Zhou, SLiao, HLiu, MFeng, GFu, BLi, RCheng, MZhao, YGong, P Discovery andw biological evaluation of novel 6,7-disubstituted-4-(2-fluorophenoxy)quinoline derivatives possessing 1,2,3-triazole-4-carboxamide moiety as c-Met kinase inhibitors. Bioorg Med Chem 22:6438-52 (2014)  
Target
Name:
Hepatocyte growth factor receptor
Synonyms:
Hepatocyte growth factor receptor Hepatocyte growth factor receptor (c-MET) MET Met proto-oncogene (hepatocyte growth factor receptor) Tyrosine-protein kinase Met (c-Met) c-Met kinase
Type:
Protein
Mol. Mass.:
155559.73
Organism:
Homo sapiens (Human)
Description:
P08581
Residue:
1390
  
Inhibitor
Name:
BDBM50035417
Synonyms:
CHEMBL3343390
Type:
Small organic molecule
Emp. Form.:
C35H33F5N6O4
Mol. Mass.:
696.6663
SMILES:
COc1cc2c(Oc3ccc(NC(=O)c4nnn(c4C(F)(F)F)-c4ccc(F)cc4)cc3F)ccnc2cc1OCCCN1CCC(C)CC1
: