Target
Hepatocyte growth factor receptor
Ligand
BDBM50035427
Substrate
Meas. Tech.
ChEMBL_1432749 (CHEMBL3381417)
IC50
25±n/a nM
Citation
 Zhou, SLiao, HLiu, MFeng, GFu, BLi, RCheng, MZhao, YGong, P Discovery andw biological evaluation of novel 6,7-disubstituted-4-(2-fluorophenoxy)quinoline derivatives possessing 1,2,3-triazole-4-carboxamide moiety as c-Met kinase inhibitors. Bioorg Med Chem 22:6438-52 (2014)  
Target
Name:
Hepatocyte growth factor receptor
Synonyms:
Hepatocyte growth factor receptor Hepatocyte growth factor receptor (c-MET) MET Met proto-oncogene (hepatocyte growth factor receptor) Tyrosine-protein kinase Met (c-Met) c-Met kinase
Type:
Protein
Mol. Mass.:
155559.73
Organism:
Homo sapiens (Human)
Description:
P08581
Residue:
1390
  
Inhibitor
Name:
BDBM50035427
Synonyms:
CHEMBL3343400
Type:
Small organic molecule
Emp. Form.:
C35H35F4N7O5
Mol. Mass.:
709.6899
SMILES:
COc1ccc(cc1)-n1nnc(C(=O)Nc2ccc(Oc3ccnc4cc(OCCCN5CCN(C)CC5)c(OC)cc34)c(F)c2)c1C(F)(F)F
: