Target
Epidermal growth factor receptor
Ligand
BDBM50035354
Substrate
Meas. Tech.
ChEMBL_1432748 (CHEMBL3381416)
IC50
>10000±n/a nM
Citation
 Zhou, SLiao, HLiu, MFeng, GFu, BLi, RCheng, MZhao, YGong, P Discovery andw biological evaluation of novel 6,7-disubstituted-4-(2-fluorophenoxy)quinoline derivatives possessing 1,2,3-triazole-4-carboxamide moiety as c-Met kinase inhibitors. Bioorg Med Chem 22:6438-52 (2014)  
Target
Name:
Epidermal growth factor receptor
Synonyms:
EGF Receptor Substrate EGFR_HUMAN ERBB1 Epidermal Growth Factor Receptor erbB-1 Epidermal growth factor receptor (EGFR) HER1 Proto-oncogene c-ErbB-1 Tyrosine-Protein Kinase ErbB-1
Type:
Receptor Kinase Domain
Mol. Mass.:
134279.59
Organism:
Homo sapiens (Human)
Description:
P00533
Residue:
1210
  
Inhibitor
Name:
BDBM50035354
Synonyms:
CHEMBL3343366
Type:
Small organic molecule
Emp. Form.:
C33H29F5N6O4
Mol. Mass.:
668.6132
SMILES:
COc1cc2c(Oc3ccc(NC(=O)c4nnn(c4C(F)(F)F)-c4ccc(F)cc4)cc3F)ccnc2cc1OCCCN1CCCC1
: