Target
C-X-C chemokine receptor type 2
Ligand
BDBM50036877
Substrate
Meas. Tech.
ChEMBL_1434449 (CHEMBL3388266)
IC50
50±n/a nM
Citation
 Lu, HYang, TXu, ZWren, PBZhang, YCai, XPatel, MDong, KZhang, QZhang, WGuan, XXiang, JElliott, JDLin, XRen, F 2-Aminopyrimidin-4(1H)-one as the novel bioisostere of urea: discovery of novel and potent CXCR2 antagonists. Bioorg Med Chem Lett 24:5493-6 (2015)  
Target
Name:
C-X-C chemokine receptor type 2
Synonyms:
C-X-C chemokine receptor type 2 (CXCR-2) CD_antigen=CD182 CXCR-2 CXCR2_HUMAN GRO/MGSA receptor IL-8 receptor type 2 IL8RB | Interleukin-8 receptor B
Type:
Protein
Mol. Mass.:
40767.88
Organism:
Homo sapiens (Human)
Description:
P25025
Residue:
360
  
Inhibitor
Name:
BDBM50036877
Synonyms:
CHEMBL3355248
Type:
Small organic molecule
Emp. Form.:
C17H19ClFN3O4S
Mol. Mass.:
415.867
SMILES:
CC(C)S(=O)(=O)c1c(Cl)ccc(Nc2nc(=O)c(F)c([nH]2)C2CCC2)c1O
: