Target
Genome polyprotein
Ligand
BDBM50037502
Substrate
Meas. Tech.
ChEMBL_1437305 (CHEMBL3384808)
Ki
300±n/a nM
Citation
 Lampa, AAlogheli, HEhrenberg, AEÅkerblom, ESvensson, RArtursson, PDanielson, UHKarlén, ASandström, A Vinylated linear P2 pyrimidinyloxyphenylglycine based inhibitors of the HCV NS3/4A protease and corresponding macrocycles. Bioorg Med Chem 22:6595-615 (2015)  
Target
Name:
Genome polyprotein
Synonyms:
Nonstructural protein NS3-4A
Type:
PROTEIN
Mol. Mass.:
71633.49
Organism:
Hepatitis C virus
Description:
ChEMBL_109716
Residue:
674
  
Inhibitor
Name:
BDBM50037502
Synonyms:
CHEMBL1170421
Type:
Small organic molecule
Emp. Form.:
C42H57N5O9S
Mol. Mass.:
807.995
SMILES:
CCC[C@H](NC(=O)[C@@H]1C[C@H](CN1C(=O)[C@@H](NC(=O)OC(C)(C)C)C(C)(C)C)Oc1cc(nc2cc(OC)ccc12)-c1ccccc1)C(=O)NS(=O)(=O)CCCC=C
: