Target
Genome polyprotein
Ligand
BDBM50037446
Substrate
Meas. Tech.
ChEMBL_1437305 (CHEMBL3384808)
Ki
390±n/a nM
Citation
 Lampa, AAlogheli, HEhrenberg, AEÅkerblom, ESvensson, RArtursson, PDanielson, UHKarlén, ASandström, A Vinylated linear P2 pyrimidinyloxyphenylglycine based inhibitors of the HCV NS3/4A protease and corresponding macrocycles. Bioorg Med Chem 22:6595-615 (2015)  
Target
Name:
Genome polyprotein
Synonyms:
Nonstructural protein NS3-4A
Type:
PROTEIN
Mol. Mass.:
71633.49
Organism:
Hepatitis C virus
Description:
ChEMBL_109716
Residue:
674
  
Inhibitor
Name:
BDBM50037446
Synonyms:
CHEMBL3356718
Type:
Small organic molecule
Emp. Form.:
C41H44N6O8S
Mol. Mass.:
780.888
SMILES:
CC(C)(C)[C@@H]1NC(=O)OCC\C=C\c2cc(Oc3ccc(cc3)[C@H](NC1=O)C(=O)Nc1ccccc1C(=O)NS(=O)(=O)CCCC=C)nc(n2)-c1ccccc1
: