Target
Genome polyprotein
Ligand
BDBM50037467
Substrate
Meas. Tech.
ChEMBL_1437305 (CHEMBL3384808)
Ki
33±n/a nM
Citation
 Lampa, AAlogheli, HEhrenberg, AEÅkerblom, ESvensson, RArtursson, PDanielson, UHKarlén, ASandström, A Vinylated linear P2 pyrimidinyloxyphenylglycine based inhibitors of the HCV NS3/4A protease and corresponding macrocycles. Bioorg Med Chem 22:6595-615 (2015)  
Target
Name:
Genome polyprotein
Synonyms:
Nonstructural protein NS3-4A
Type:
PROTEIN
Mol. Mass.:
71633.49
Organism:
Hepatitis C virus
Description:
ChEMBL_109716
Residue:
674
  
Inhibitor
Name:
BDBM50037467
Synonyms:
CHEMBL3125047
Type:
Small organic molecule
Emp. Form.:
C44H52N6O9S
Mol. Mass.:
840.983
SMILES:
COc1cc(Oc2ccc(cc2C=C)[C@@H](NC(=O)[C@@H](NC(=O)OC(C)(C)C)C(C)(C)C)C(=O)Nc2ccccc2C(=O)NS(=O)(=O)CCCC=C)nc(n1)-c1ccccc1
: