Target
Peroxisome proliferator-activated receptor alpha
Ligand
BDBM50041008
Substrate
Meas. Tech.
ChEMBL_1444971 (CHEMBL3371803)
EC50
12±n/a nM
Citation
 Gangwal, RPDamre, MVDas, NRSharma, SSSangamwar, AT Biological evaluation and structural insights for design of subtype-selective peroxisome proliferator activated receptor-a (PPAR-a) agonists. Bioorg Med Chem Lett 25:270-5 (2014)  
Target
Name:
Peroxisome proliferator-activated receptor alpha
Synonyms:
NR1C1 PPAR PPAR-alpha PPARA_HUMAN Peroxisome proliferator-activated receptor | Peroxisome proliferator-activated receptor alpha (PPAR alpha)
Type:
Enzyme
Mol. Mass.:
52222.08
Organism:
Homo sapiens (Human)
Description:
Q07869
Residue:
468
  
Inhibitor
Name:
BDBM50041008
Synonyms:
CHEMBL3354988
Type:
Small organic molecule
Emp. Form.:
C25H25NO8S
Mol. Mass.:
499.533
SMILES:
CCOC(=O)C1=C(Nc2ccc(OCC)cc2)S\C(=C\c2ccc(OCC(O)=O)c(OC)c2)C1=O
: