Target
Peroxisome proliferator-activated receptor alpha
Ligand
BDBM50360740
Substrate
Meas. Tech.
ChEMBL_1444971 (CHEMBL3371803)
EC50
5.0±n/a nM
Citation
 Gangwal, RPDamre, MVDas, NRSharma, SSSangamwar, AT Biological evaluation and structural insights for design of subtype-selective peroxisome proliferator activated receptor-a (PPAR-a) agonists. Bioorg Med Chem Lett 25:270-5 (2014)  
Target
Name:
Peroxisome proliferator-activated receptor alpha
Synonyms:
NR1C1 PPAR PPAR-alpha PPARA_HUMAN Peroxisome proliferator-activated receptor | Peroxisome proliferator-activated receptor alpha (PPAR alpha)
Type:
Enzyme
Mol. Mass.:
52222.08
Organism:
Homo sapiens (Human)
Description:
Q07869
Residue:
468
  
Inhibitor
Name:
BDBM50360740
Synonyms:
CHEMBL1934476
Type:
Small organic molecule
Emp. Form.:
C23H22ClN3O3S
Mol. Mass.:
455.957
SMILES:
Cc1nc(sc1C(=O)N[C@H]1CCCN(C1)c1cccc(c1)C(O)=O)-c1ccc(Cl)cc1
: