Target
Peroxisome proliferator-activated receptor delta
Ligand
BDBM50360748
Substrate
Meas. Tech.
ChEMBL_1444972 (CHEMBL3371804)
EC50
11000±n/a nM
Citation
 Gangwal, RPDamre, MVDas, NRSharma, SSSangamwar, AT Biological evaluation and structural insights for design of subtype-selective peroxisome proliferator activated receptor-a (PPAR-a) agonists. Bioorg Med Chem Lett 25:270-5 (2014)  
Target
Name:
Peroxisome proliferator-activated receptor delta
Synonyms:
NR1C2 NUCI Nuclear receptor subfamily 1 group C member 2 PPAR-beta PPARD Peroxisome proliferator-activated receptor Peroxisome proliferator-activated receptor delta
Type:
Enzyme
Mol. Mass.:
49910.45
Organism:
Homo sapiens (Human)
Description:
Q03181
Residue:
441
  
Inhibitor
Name:
BDBM50360748
Synonyms:
CHEMBL1934484
Type:
Small organic molecule
Emp. Form.:
C24H25N3O3S
Mol. Mass.:
435.539
SMILES:
Cc1nc(sc1C(=O)N[C@H]1CCCN(C1)c1cccc(c1)C(O)=O)-c1ccc(C)cc1
: