Target
Tyrosine-protein phosphatase non-receptor type 1
Ligand
BDBM50041386
Substrate
Meas. Tech.
ChEMBL_1445877 (CHEMBL3377304)
IC50
3850±n/a nM
Citation
 Yang, PLiu, DQLiang, TJLi, JZhang, HYLiu, AHGuo, YWMao, SC Bioactive constituents from the green alga Caulerpa racemosa. Bioorg Med Chem 23:38-45 (2014)  
Target
Name:
Tyrosine-protein phosphatase non-receptor type 1
Synonyms:
PTN1_HUMAN PTPN1 Protein tyrosine phosphatase-1B (PTP1B) Protein-tyrosine phosphatase 1B (PTP1B) Tyrosine-protein phosphatase non-receptor type 1 (PTP1B)
Type:
Protein phosphatase
Mol. Mass.:
49963.76
Organism:
Homo sapiens (Human)
Description:
Human recombinant GST-fusion PTP1B (1-435).
Residue:
435
  
Inhibitor
Name:
BDBM50041386
Synonyms:
Alpha-Tocopherylquinone | CHEMBL1223852
Type:
Small organic molecule
Emp. Form.:
C29H50O3
Mol. Mass.:
446.7055
SMILES:
CC(C)CCC[C@@H](C)CCC[C@@H](C)CCC[C@@](C)(O)CCC1=C(C)C(=O)C(C)=C(C)C1=O
: