Target
Sphingosine 1-phosphate receptor 2
Ligand
BDBM50041691
Substrate
Meas. Tech.
ChEMBL_1446120 (CHEMBL3381000)
EC50
>10000±n/a nM
Citation
 Buzard, DJKim, SHLopez, LKawasaki, AZhu, XMoody, JThoresen, LCalderon, IUllman, BHan, SLehmann, JGharbaoui, TSengupta, DCalvano, LMontalban, AGMa, YASage, CGao, YSemple, GEdwards, JBarden, JMorgan, MChen, WUsmani, KChen, CSadeque, AChristopher, RJThatte, JFu, LSolomon, MMills, DWhelan, KAl-Shamma, HGatlin, JLe, MGaidarov, IAnthony, TUnett, DJBlackburn, ARueter, JStirn, SBehan, DPJones, RM Discovery of APD334: Design of a Clinical Stage Functional Antagonist of the Sphingosine-1-phosphate-1 Receptor. ACS Med Chem Lett 5:1313-7 (2014)  
Target
Name:
Sphingosine 1-phosphate receptor 2
Synonyms:
EDG5 S1PR2 Sphingosine 1-phosphate receptor Sphingosine-1-phosphate receptor 2 | ndothelial differentiation G-protein coupled receptor 5
Type:
G Protein-Coupled Receptor (GPCR)
Mol. Mass.:
38883.16
Organism:
Homo sapiens (Human)
Description:
Membranes isolated from S1P2-transfected CHO cells were used in ligand binding assay.
Residue:
353
  
Inhibitor
Name:
BDBM50041691
Synonyms:
CHEMBL3358920 | US11149292, Compound (R)-2-(7-(4-cyclopentyl-3-(trifluoromethyl)benzyloxy)-
Type:
Small organic molecule
Emp. Form.:
C26H26F3NO3
Mol. Mass.:
457.4847
SMILES:
OC(=O)C[C@H]1CCc2c1[nH]c1ccc(OCc3ccc(C4CCCC4)c(c3)C(F)(F)F)cc21
: