Target
Vascular endothelial growth factor receptor 2
Ligand
BDBM50044260
Substrate
Meas. Tech.
ChEMBL_1446504 (CHEMBL3376778)
IC50
2.7±n/a nM
Citation
 Khan, IIbrar, AAbbas, NSaeed, A Recent advances in the structural library of functionalized quinazoline and quinazolinone scaffolds: synthetic approaches and multifarious applications. Eur J Med Chem 76:193-244 (2014)  
Target
Name:
Vascular endothelial growth factor receptor 2
Synonyms:
CD_antigen=CD309 Fetal liver kinase 1 (FLK-1) KDR Protein-tyrosine kinase receptor Flk-1 VEGFR-2 VEGFR2 Vascular Endothelial Growth Factor Receptor Kinase 2 Vascular endothelial growth factor receptor 2 (KDR) Vascular endothelial growth factor receptor 2 (VEGFR2) Vascular endothelial growth factor receptor-2 (VEGFR-2)
Type:
Receptor Tyrosine Kinase
Mol. Mass.:
151510.97
Organism:
Homo sapiens (Human)
Description:
P35968
Residue:
1356
  
Inhibitor
Name:
BDBM50044260
Synonyms:
CHEMBL3310053
Type:
Small organic molecule
Emp. Form.:
C14H13N5O3
Mol. Mass.:
299.2847
SMILES:
Cc1ncc(n1CCOc1ncnc2ccccc12)[N+]([O-])=O
: