Target
5-hydroxytryptamine receptor 6
Ligand
BDBM50163069
Substrate
Meas. Tech.
ChEMBL_1459806 (CHEMBL3371192)
Ki
1.4±n/a nM
Citation
 Benhamú, BMartín-Fontecha, MVázquez-Villa, HPardo, LLópez-Rodríguez, ML Serotonin 5-HT6 receptor antagonists for the treatment of cognitive deficiency in Alzheimer's disease. J Med Chem 57:7160-81 (2014)  
Target
Name:
5-hydroxytryptamine receptor 6
Synonyms:
5-HT-6 5-hydroxytryptamine receptor 6 (5-HT-6) 5-hydroxytryptamine receptor 6 (5HT6) HTR6 Serotonin 6 (5-HT6) receptor | Serotonin Receptor 6
Type:
G Protein-Coupled Receptor (GPCR)
Mol. Mass.:
46968.43
Organism:
Homo sapiens (Human)
Description:
P50406
Residue:
440
  
Inhibitor
Name:
BDBM50163069
Synonyms:
1-Benzenesulfonyl-5-chloro-3-((R)-1-methyl-pyrrolidin-2-ylmethyl)-1H-indole | CHEMBL361213
Type:
Small organic molecule
Emp. Form.:
C20H21ClN2O2S
Mol. Mass.:
388.911
SMILES:
CN1CCC[C@@H]1Cc1cn(c2ccc(Cl)cc12)S(=O)(=O)c1ccccc1
: