Target
5-hydroxytryptamine receptor 6
Ligand
BDBM50193464
Substrate
Meas. Tech.
ChEMBL_1459806 (CHEMBL3371192)
Ki
1.2±n/a nM
Citation
 Benhamú, BMartín-Fontecha, MVázquez-Villa, HPardo, LLópez-Rodríguez, ML Serotonin 5-HT6 receptor antagonists for the treatment of cognitive deficiency in Alzheimer's disease. J Med Chem 57:7160-81 (2014)  
Target
Name:
5-hydroxytryptamine receptor 6
Synonyms:
5-HT-6 5-hydroxytryptamine receptor 6 (5-HT-6) 5-hydroxytryptamine receptor 6 (5HT6) HTR6 Serotonin 6 (5-HT6) receptor | Serotonin Receptor 6
Type:
G Protein-Coupled Receptor (GPCR)
Mol. Mass.:
46968.43
Organism:
Homo sapiens (Human)
Description:
P50406
Residue:
440
  
Inhibitor
Name:
BDBM50193464
Synonyms:
4-(3-benzenesulfonylphenyl)piperazine | CHEMBL212995
Type:
Small organic molecule
Emp. Form.:
C16H18N2O2S
Mol. Mass.:
302.391
SMILES:
O=S(=O)(c1ccccc1)c1cccc(c1)N1CCNCC1
: