Target
5-hydroxytryptamine receptor 6
Ligand
BDBM50130270
Substrate
Meas. Tech.
ChEMBL_1459806 (CHEMBL3371192)
Ki
0.800000±n/a nM
Citation
 Benhamú, BMartín-Fontecha, MVázquez-Villa, HPardo, LLópez-Rodríguez, ML Serotonin 5-HT6 receptor antagonists for the treatment of cognitive deficiency in Alzheimer's disease. J Med Chem 57:7160-81 (2014)  
Target
Name:
5-hydroxytryptamine receptor 6
Synonyms:
5-HT-6 5-hydroxytryptamine receptor 6 (5-HT-6) 5-hydroxytryptamine receptor 6 (5HT6) HTR6 Serotonin 6 (5-HT6) receptor | Serotonin Receptor 6
Type:
G Protein-Coupled Receptor (GPCR)
Mol. Mass.:
46968.43
Organism:
Homo sapiens (Human)
Description:
P50406
Residue:
440
  
Inhibitor
Name:
BDBM50130270
Synonyms:
5-Chloro-3-methyl-benzo[b]thiophene-2-sulfonic acid ((S)-3-hexahydro-pyrrolo[1,2-a]pyrazin-2-yl-4-methoxy-phenyl)-amide CHEMBL29433
Type:
Small organic molecule
Emp. Form.:
C23H26ClN3O3S2
Mol. Mass.:
492.054
SMILES:
COc1ccc(NS(=O)(=O)c2sc3ccc(Cl)cc3c2C)cc1N1CCN2CCC[C@H]2C1
: