Target
5-hydroxytryptamine receptor 6
Ligand
BDBM50044603
Substrate
Meas. Tech.
ChEMBL_1459806 (CHEMBL3371192)
Ki
3.8±n/a nM
Citation
 Benhamú, BMartín-Fontecha, MVázquez-Villa, HPardo, LLópez-Rodríguez, ML Serotonin 5-HT6 receptor antagonists for the treatment of cognitive deficiency in Alzheimer's disease. J Med Chem 57:7160-81 (2014)  
Target
Name:
5-hydroxytryptamine receptor 6
Synonyms:
5-HT-6 5-hydroxytryptamine receptor 6 (5-HT-6) 5-hydroxytryptamine receptor 6 (5HT6) HTR6 Serotonin 6 (5-HT6) receptor | Serotonin Receptor 6
Type:
G Protein-Coupled Receptor (GPCR)
Mol. Mass.:
46968.43
Organism:
Homo sapiens (Human)
Description:
P50406
Residue:
440
  
Inhibitor
Name:
BDBM50044603
Synonyms:
CHEMBL3329443
Type:
Small organic molecule
Emp. Form.:
C21H21NO2S
Mol. Mass.:
351.462
SMILES:
O=S(=O)(c1ccccc1)c1ccc(C2CCNCC2)c2ccccc12
: