Target
5-hydroxytryptamine receptor 6
Ligand
BDBM50044611
Substrate
Meas. Tech.
ChEMBL_1459806 (CHEMBL3371192)
Ki
5.7±n/a nM
Citation
 Benhamú, BMartín-Fontecha, MVázquez-Villa, HPardo, LLópez-Rodríguez, ML Serotonin 5-HT6 receptor antagonists for the treatment of cognitive deficiency in Alzheimer's disease. J Med Chem 57:7160-81 (2014)  
Target
Name:
5-hydroxytryptamine receptor 6
Synonyms:
5-HT-6 5-hydroxytryptamine receptor 6 (5-HT-6) 5-hydroxytryptamine receptor 6 (5HT6) HTR6 Serotonin 6 (5-HT6) receptor | Serotonin Receptor 6
Type:
G Protein-Coupled Receptor (GPCR)
Mol. Mass.:
46968.43
Organism:
Homo sapiens (Human)
Description:
P50406
Residue:
440
  
Inhibitor
Name:
BDBM50044611
Synonyms:
CHEMBL3329437
Type:
Small organic molecule
Emp. Form.:
C22H19N3O3S
Mol. Mass.:
405.47
SMILES:
O=c1n(C2=CCNCC2)c2ccccc2n1S(=O)(=O)c1ccc2ccccc2c1
: