Target
5-hydroxytryptamine receptor 6
Ligand
BDBM50044615
Substrate
Meas. Tech.
ChEMBL_1459806 (CHEMBL3371192)
Ki
0.530000±n/a nM
Citation
 Benhamú, BMartín-Fontecha, MVázquez-Villa, HPardo, LLópez-Rodríguez, ML Serotonin 5-HT6 receptor antagonists for the treatment of cognitive deficiency in Alzheimer's disease. J Med Chem 57:7160-81 (2014)  
Target
Name:
5-hydroxytryptamine receptor 6
Synonyms:
5-HT-6 5-hydroxytryptamine receptor 6 (5-HT-6) 5-hydroxytryptamine receptor 6 (5HT6) HTR6 Serotonin 6 (5-HT6) receptor | Serotonin Receptor 6
Type:
G Protein-Coupled Receptor (GPCR)
Mol. Mass.:
46968.43
Organism:
Homo sapiens (Human)
Description:
P50406
Residue:
440
  
Inhibitor
Name:
BDBM50044615
Synonyms:
CHEMBL3329435
Type:
Small organic molecule
Emp. Form.:
C18H20N4O2S
Mol. Mass.:
356.442
SMILES:
Cc1nc2c(cccc2n1S(=O)(=O)c1ccccc1)N1CCNCC1
: