Target
5-hydroxytryptamine receptor 6
Ligand
BDBM50163091
Substrate
Meas. Tech.
ChEMBL_1459806 (CHEMBL3371192)
Ki
9.8±n/a nM
Citation
 Benhamú, BMartín-Fontecha, MVázquez-Villa, HPardo, LLópez-Rodríguez, ML Serotonin 5-HT6 receptor antagonists for the treatment of cognitive deficiency in Alzheimer's disease. J Med Chem 57:7160-81 (2014)  
Target
Name:
5-hydroxytryptamine receptor 6
Synonyms:
5-HT-6 5-hydroxytryptamine receptor 6 (5-HT-6) 5-hydroxytryptamine receptor 6 (5HT6) HTR6 Serotonin 6 (5-HT6) receptor | Serotonin Receptor 6
Type:
G Protein-Coupled Receptor (GPCR)
Mol. Mass.:
46968.43
Organism:
Homo sapiens (Human)
Description:
P50406
Residue:
440
  
Inhibitor
Name:
BDBM50163091
Synonyms:
6-Chloro-imidazo[2,1-b]thiazole-5-sulfonic acid [1-(2-pyrrolidin-1-yl-ethyl)-1H-indol-5-yl]-amide | CHEMBL367088
Type:
Small organic molecule
Emp. Form.:
C19H20ClN5O2S2
Mol. Mass.:
449.977
SMILES:
Clc1nc2sccn2c1S(=O)(=O)Nc1ccc2n(CCN3CCCC3)ccc2c1
: