Target
5-hydroxytryptamine receptor 6
Ligand
BDBM50163055
Substrate
Meas. Tech.
ChEMBL_1459806 (CHEMBL3371192)
Ki
5.3±n/a nM
Citation
 Benhamú, BMartín-Fontecha, MVázquez-Villa, HPardo, LLópez-Rodríguez, ML Serotonin 5-HT6 receptor antagonists for the treatment of cognitive deficiency in Alzheimer's disease. J Med Chem 57:7160-81 (2014)  
Target
Name:
5-hydroxytryptamine receptor 6
Synonyms:
5-HT-6 5-hydroxytryptamine receptor 6 (5-HT-6) 5-hydroxytryptamine receptor 6 (5HT6) HTR6 Serotonin 6 (5-HT6) receptor | Serotonin Receptor 6
Type:
G Protein-Coupled Receptor (GPCR)
Mol. Mass.:
46968.43
Organism:
Homo sapiens (Human)
Description:
P50406
Residue:
440
  
Inhibitor
Name:
BDBM50163055
Synonyms:
5-Chloro-3-methyl-benzo[b]thiophene-2-sulfonic acid (3-dimethylaminomethyl-1H-indol-5-yl)-amide | CHEMBL177605
Type:
Small organic molecule
Emp. Form.:
C20H20ClN3O2S2
Mol. Mass.:
433.975
SMILES:
CN(C)Cc1c[nH]c2ccc(NS(=O)(=O)c3sc4ccc(Cl)cc4c3C)cc12
: