Target
5-hydroxytryptamine receptor 2B
Ligand
BDBM50445614
Substrate
Meas. Tech.
ChEMBL_1450028 (CHEMBL3373290)
Ki
104±n/a nM
Citation
 Rajagopalan, PTracey, HChen, ZBandyopadhyaya, AVeeraraghavan, SRajagopalan, DRSalvemini, DMcPhee, IViswanadha, SRajagopalan, R DDD-028: a potent potential non-opioid, non-cannabinoid analgesic for neuropathic and inflammatory pain. Bioorg Med Chem Lett 24:3088-91 (2014)  
Target
Name:
5-hydroxytryptamine receptor 2B
Synonyms:
5-HT-2B 5-hydroxytryptamine (serotonin) receptor 2B [Homo sapiens] 5-hydroxytryptamine receptor 2C (5HT2C) HTR2B Serotonin 2b (5-HT2b) receptor | Serotonin Receptor 2B
Type:
G Protein-Coupled Receptor (GPCR)
Mol. Mass.:
54312.47
Organism:
Homo sapiens (Human)
Description:
Receptor binding assays were performed using human clone stably expressed in CHO cells.
Residue:
481
  
Inhibitor
Name:
BDBM50445614
Synonyms:
CHEMBL3104093
Type:
Small organic molecule
Emp. Form.:
C20H20N2
Mol. Mass.:
288.3862
SMILES:
CN1CCc2c(C1)c1cccc3-c4ccccc4CCn2c13
: