Target
5-hydroxytryptamine receptor 2B
Ligand
BDBM50045478
Substrate
Meas. Tech.
ChEMBL_1447539 (CHEMBL3373146)
Ki
1.5±n/a nM
Citation
 Moritomo, AYamada, HWatanabe, TItahana, HKoga, YAkuzawa, SOkada, M Synthesis and structure-activity relationships of new carbonyl guanidine derivatives as novel dual 5-HT2B and 5-HT7 receptor antagonists. Part 2. Bioorg Med Chem 22:4323-37 (2014)  
Target
Name:
5-hydroxytryptamine receptor 2B
Synonyms:
5-HT-2B 5-hydroxytryptamine (serotonin) receptor 2B [Homo sapiens] 5-hydroxytryptamine receptor 2C (5HT2C) HTR2B Serotonin 2b (5-HT2b) receptor | Serotonin Receptor 2B
Type:
G Protein-Coupled Receptor (GPCR)
Mol. Mass.:
54312.47
Organism:
Homo sapiens (Human)
Description:
Receptor binding assays were performed using human clone stably expressed in CHO cells.
Residue:
481
  
Inhibitor
Name:
BDBM50045478
Synonyms:
CHEMBL3310109
Type:
Small organic molecule
Emp. Form.:
C15H13Cl2N3O2
Mol. Mass.:
338.189
SMILES:
Cl.[#7]\[#6](-[#7])=[#7]/[#6](=O)-c1ccc-2c(c1)-[#6](-[#8])-c1cccc(Cl)c-21
: