Target
UDP-N-acetylmuramate--L-alanine ligase
Ligand
BDBM50046819
Substrate
Meas. Tech.
ChEMBL_1452804 (CHEMBL3365475)
IC50
44000±n/a nM
Citation
 Perdih, AHrast, MBarreteau, HGobec, SWolber, GSolmajer, T Benzene-1,3-dicarboxylic acid 2,5-dimethylpyrrole derivatives as multiple inhibitors of bacterial Mur ligases (MurC-MurF). Bioorg Med Chem 22:4124-34 (2014)  
Target
Name:
UDP-N-acetylmuramate--L-alanine ligase
Synonyms:
MURC_ECOLI UDP-N-acetylmuramate--L-alanine ligase | murC
Type:
Protein
Mol. Mass.:
53617.78
Organism:
Escherichia coli
Description:
P17952
Residue:
491
  
Inhibitor
Name:
BDBM50046819
Synonyms:
CHEMBL3310465
Type:
Small organic molecule
Emp. Form.:
C24H18BrN3O5S
Mol. Mass.:
540.386
SMILES:
Cc1cc(\C=C2\S\C(NC2=O)=N\c2ccc(Br)cc2)c(C)n1-c1cc(cc(c1)C(O)=O)C(O)=O
: