Target
Enoyl-[acyl-carrier-protein] reductase [NADH]
Ligand
BDBM50047690
Substrate
Meas. Tech.
ChEMBL_1451023 (CHEMBL3366098)
IC50
>50000±n/a nM
Citation
 Bellale, ENaik, MV B, VAmbady, ANarayan, ARavishankar, SRamachandran, VKaur, PMcLaughlin, RWhiteaker, JMorayya, SGuptha, SSharma, SRaichurkar, AAwasthy, DAchar, VVachaspati, PBandodkar, BPanda, MChatterji, M Diarylthiazole: an antimycobacterial scaffold potentially targeting PrrB-PrrA two-component system. J Med Chem 57:6572-82 (2014)  
Target
Name:
Enoyl-[acyl-carrier-protein] reductase [NADH]
Synonyms:
Enoyl-ACP Reductase (InhA) Enoyl-[acyl-carrier-protein] reductase [NADH] NADH-dependent enoyl-ACP reductase | inhA
Type:
Enzyme
Mol. Mass.:
28526.00
Organism:
Mycobacterium tuberculosis (strain ATCC 25618 / H37Rv)
Description:
P9WGR1
Residue:
269
  
Inhibitor
Name:
BDBM50047690
Synonyms:
CHEMBL3319431
Type:
Small organic molecule
Emp. Form.:
C16H15N3S
Mol. Mass.:
281.375
SMILES:
CCCc1cc(ccn1)-c1nc(cs1)-c1ccncc1
: