Target
Adenosine receptor A1
Ligand
BDBM50109461
Substrate
Meas. Tech.
ChEMBL_1452895 (CHEMBL3366211)
Ki
594±n/a nM
Citation
 Federico, SCiancetta, APorta, NRedenti, SPastorin, GCacciari, BKlotz, KNMoro, SSpalluto, G Scaffold decoration at positions 5 and 8 of 1,2,4-triazolo[1,5-c]pyrimidines to explore the antagonist profiling on adenosine receptors: a preliminary structure-activity relationship study. J Med Chem 57:6210-25 (2014)  
Target
Name:
Adenosine receptor A1
Synonyms:
A1 adenosine receptor (hA1) AA1R_HUMAN ADORA1 Adenosine A1-receptor Adenosine receptor A1 (hA1) | Adenosine transporter (AdT)
Type:
G Protein-Coupled Receptor (GPCR)
Mol. Mass.:
36520.92
Organism:
Homo sapiens (Human)
Description:
P30542
Residue:
326
  
Inhibitor
Name:
BDBM50109461
Synonyms:
1-(2-(furan-2-yl)-8-methyl-8H-pyrazolo[4,3-e][1,2,4]triazolo[1,5-c]pyrimidin-5-yl)-3-phenylurea CHEMBL324735 | MRE 3046F20
Type:
Small organic molecule
Emp. Form.:
C18H14N8O2
Mol. Mass.:
374.3562
SMILES:
Cn1cc2c(n1)nc(NC(=O)Nc1ccccc1)n1nc(nc21)-c1ccco1
: