Target
High affinity nerve growth factor receptor
Ligand
BDBM50048357
Substrate
Meas. Tech.
ChEMBL_1446791 (CHEMBL3371265)
IC50
>10000±n/a nM
Citation
 Casale, EAmboldi, NBrasca, MGCaronni, DColombo, NDalvit, CFelder, ERFogliatto, GGalvani, AIsacchi, APolucci, PRiceputi, LSola, FVisco, CZuccotto, FCasuscelli, F Fragment-based hit discovery and structure-based optimization of aminotriazoloquinazolines as novel Hsp90 inhibitors. Bioorg Med Chem 22:4135-50 (2014)  
Target
Name:
High affinity nerve growth factor receptor
Synonyms:
2.7.10.1 NTRK1 NTRK1_HUMAN Neurotrophic tyrosine kinase receptor type 1 Synonyms=MTC TRK1-transforming tyrosine kinase protein TRKA GN Trk-A Tropomyosin-related kinase A Tyrosine kinase receptor Tyrosine kinase receptor A Tyrosine kinase receptor A (Trk-A) gp140trk | p140-TrkA
Type:
Mol. Mass.:
87498.18
Organism:
Homo sapiens (Human)
Description:
P04629
Residue:
796
  
Inhibitor
Name:
BDBM50048357
Synonyms:
CHEMBL3309990
Type:
Small organic molecule
Emp. Form.:
C17H12FN5O2
Mol. Mass.:
337.3079
SMILES:
Nc1nc2c3c(F)cccc3nc(Cc3ccc4OCOc4c3)n2n1
: