Target
Focal adhesion kinase 1
Ligand
BDBM50048357
Substrate
Meas. Tech.
ChEMBL_1446757 (CHEMBL3381072)
IC50
>10000±n/a nM
Citation
 Casale, EAmboldi, NBrasca, MGCaronni, DColombo, NDalvit, CFelder, ERFogliatto, GGalvani, AIsacchi, APolucci, PRiceputi, LSola, FVisco, CZuccotto, FCasuscelli, F Fragment-based hit discovery and structure-based optimization of aminotriazoloquinazolines as novel Hsp90 inhibitors. Bioorg Med Chem 22:4135-50 (2014)  
Target
Name:
Focal adhesion kinase 1
Synonyms:
FADK 1 FAK1 FLT4 Focal adhesion kinase (FAK) Focal adhesion kinase 1 (FAK) Focal adhesion kinase-related nonkinase PTK2 Protein-tyrosine kinase 2 p125FAK | pp125FAK
Type:
Tyrosine-protein kinase
Mol. Mass.:
119233.17
Organism:
Homo sapiens (Human)
Description:
Q05397
Residue:
1052
  
Inhibitor
Name:
BDBM50048357
Synonyms:
CHEMBL3309990
Type:
Small organic molecule
Emp. Form.:
C17H12FN5O2
Mol. Mass.:
337.3079
SMILES:
Nc1nc2c3c(F)cccc3nc(Cc3ccc4OCOc4c3)n2n1
: