Target
Serine/threonine-protein kinase haspin
Ligand
BDBM50048357
Substrate
Meas. Tech.
ChEMBL_1446761 (CHEMBL3381076)
IC50
>10000±n/a nM
Citation
 Casale, EAmboldi, NBrasca, MGCaronni, DColombo, NDalvit, CFelder, ERFogliatto, GGalvani, AIsacchi, APolucci, PRiceputi, LSola, FVisco, CZuccotto, FCasuscelli, F Fragment-based hit discovery and structure-based optimization of aminotriazoloquinazolines as novel Hsp90 inhibitors. Bioorg Med Chem 22:4135-50 (2014)  
Target
Name:
Serine/threonine-protein kinase haspin
Synonyms:
GSG2 H-haspin HASP_HUMAN | Haploid germ cell-specific nuclear protein kinase
Type:
PROTEIN
Mol. Mass.:
88531.28
Organism:
Homo sapiens (Human)
Description:
ChEMBL_1510616
Residue:
798
  
Inhibitor
Name:
BDBM50048357
Synonyms:
CHEMBL3309990
Type:
Small organic molecule
Emp. Form.:
C17H12FN5O2
Mol. Mass.:
337.3079
SMILES:
Nc1nc2c3c(F)cccc3nc(Cc3ccc4OCOc4c3)n2n1
: