Target
Inhibitor of nuclear factor kappa-B kinase subunit beta
Ligand
BDBM50048357
Substrate
Meas. Tech.
ChEMBL_1446763 (CHEMBL3381078)
IC50
>10000±n/a nM
Citation
 Casale, EAmboldi, NBrasca, MGCaronni, DColombo, NDalvit, CFelder, ERFogliatto, GGalvani, AIsacchi, APolucci, PRiceputi, LSola, FVisco, CZuccotto, FCasuscelli, F Fragment-based hit discovery and structure-based optimization of aminotriazoloquinazolines as novel Hsp90 inhibitors. Bioorg Med Chem 22:4135-50 (2014)  
Target
Name:
Inhibitor of nuclear factor kappa-B kinase subunit beta
Synonyms:
I-kappa-B Kinase 2 (IKK-beta) I-kappa-B-kinase beta IKBKB IKK-beta IKK2/IKK1 IKKB_HUMAN Inhibitor of nuclear factor kappa B kinase beta subunit Nuclear factor NF-kappa-B inhibitor kinase beta
Type:
Serine/threonine-protein kinase
Mol. Mass.:
86554.39
Organism:
Homo sapiens (Human)
Description:
GST-tagged IKK-2 was expressed in High Five cells and purified.
Residue:
756
  
Inhibitor
Name:
BDBM50048357
Synonyms:
CHEMBL3309990
Type:
Small organic molecule
Emp. Form.:
C17H12FN5O2
Mol. Mass.:
337.3079
SMILES:
Nc1nc2c3c(F)cccc3nc(Cc3ccc4OCOc4c3)n2n1
: