Target
Mast/stem cell growth factor receptor Kit
Ligand
BDBM50332020
Substrate
Meas. Tech.
ChEMBL_1459997 (CHEMBL3368317)
IC50
126±n/a nM
Citation
 Lee, SLee, HKim, JLee, SKim, SJChoi, BSHong, SSHong, S Development and biological evaluation of potent and selective c-KIT(D816V) inhibitors. J Med Chem 57:6428-43 (2014)  
Target
Name:
Mast/stem cell growth factor receptor Kit
Synonyms:
CD117 antigen KIT Mast/stem cell growth factor receptor Kit (cKIT) Proto-oncogene tyrosine-protein kinase Kit Stem cell growth factor receptor Tyrosine-protein kinase Kit c-kit v-kit Hardy-Zuckerman 4 feline sarcoma viral oncogene homolog
Type:
Protein
Mol. Mass.:
109869.37
Organism:
Homo sapiens (Human)
Description:
P10721
Residue:
976
  
Inhibitor
Name:
BDBM50332020
Synonyms:
CHEMBL1289468 | N-(3-(3-(3,4-dimethoxyphenyl)-1H-pyrrolo[2,3-b]pyridin-5-yl)phenyl)benzenesulfonamide
Type:
Small organic molecule
Emp. Form.:
C27H23N3O4S
Mol. Mass.:
485.554
SMILES:
COc1ccc(cc1OC)-c1c[nH]c2ncc(cc12)-c1cccc(NS(=O)(=O)c2ccccc2)c1
: