Target
Mast/stem cell growth factor receptor Kit
Ligand
BDBM50055047
Substrate
Meas. Tech.
ChEMBL_1459997 (CHEMBL3368317)
IC50
102±n/a nM
Citation
 Lee, SLee, HKim, JLee, SKim, SJChoi, BSHong, SSHong, S Development and biological evaluation of potent and selective c-KIT(D816V) inhibitors. J Med Chem 57:6428-43 (2014)  
Target
Name:
Mast/stem cell growth factor receptor Kit
Synonyms:
CD117 antigen KIT Mast/stem cell growth factor receptor Kit (cKIT) Proto-oncogene tyrosine-protein kinase Kit Stem cell growth factor receptor Tyrosine-protein kinase Kit c-kit v-kit Hardy-Zuckerman 4 feline sarcoma viral oncogene homolog
Type:
Protein
Mol. Mass.:
109869.37
Organism:
Homo sapiens (Human)
Description:
P10721
Residue:
976
  
Inhibitor
Name:
BDBM50055047
Synonyms:
CHEMBL3319456
Type:
Small organic molecule
Emp. Form.:
C21H16F2N2O2
Mol. Mass.:
366.3607
SMILES:
COc1ccc(cc1OC)-c1c[nH]c2ncc(cc12)-c1cc(F)cc(F)c1
: