Target
2'-deoxynucleoside 5'-phosphate N-hydrolase 1
Ligand
BDBM50056959
Substrate
Meas. Tech.
ChEMBL_1455848 (CHEMBL3362302)
Ki
1800±n/a nM
Citation
 Amiable, CPaoletti, JHaouz, APadilla, ALabesse, GKaminski, PAPochet, S 6-(Hetero)Arylpurine nucleotides as inhibitors of the oncogenic target DNPH1: synthesis, structural studies and cytotoxic activities. Eur J Med Chem 85:418-37 (2014)  
Target
Name:
2'-deoxynucleoside 5'-phosphate N-hydrolase 1
Synonyms:
DNPH1_RAT Deoxyribonucleoside 5'-monophosphate N-glycosidase (Rcl) D69N Deoxyribonucleoside 5'-monophosphate N-glycosidase (Rcl) S117A Dnph1 c-Myc-responsive protein Rcl
Type:
Enzyme
Mol. Mass.:
17775.23
Organism:
Rattus norvegicus (Rat)
Description:
O35820
Residue:
163
  
Inhibitor
Name:
BDBM50056959
Synonyms:
CHEMBL3331373
Type:
Small organic molecule
Emp. Form.:
C14H15N4O8P
Mol. Mass.:
398.2647
SMILES:
O[C@@H]1[C@@H](COP(O)(O)=O)O[C@H]([C@@H]1O)n1cnc2c(ncnc12)-c1ccoc1
: