Target
2'-deoxynucleoside 5'-phosphate N-hydrolase 1
Ligand
BDBM50056960
Substrate
Meas. Tech.
ChEMBL_1455849 (CHEMBL3362303)
Ki
3700±n/a nM
Citation
 Amiable, CPaoletti, JHaouz, APadilla, ALabesse, GKaminski, PAPochet, S 6-(Hetero)Arylpurine nucleotides as inhibitors of the oncogenic target DNPH1: synthesis, structural studies and cytotoxic activities. Eur J Med Chem 85:418-37 (2014)  
Target
Name:
2'-deoxynucleoside 5'-phosphate N-hydrolase 1
Synonyms:
C6orf108 DNPH1 RCL | c-Myc-responsive protein RCL
Type:
PROTEIN
Mol. Mass.:
19102.16
Organism:
Homo sapiens (Human)
Description:
ChEMBL_109542
Residue:
174
  
Inhibitor
Name:
BDBM50056960
Synonyms:
CHEMBL3331372
Type:
Small organic molecule
Emp. Form.:
C20H22N5O10P
Mol. Mass.:
523.3899
SMILES:
O[C@@H]1[C@@H](COP(O)(O)=O)O[C@H]([C@@H]1O)n1cnc2c(ncnc12)-c1ccc(NC(=O)CCC(O)=O)cc1
: