Target
Phosphoethanolamine/phosphocholine phosphatase
Ligand
BDBM34737
Substrate
Meas. Tech.
ChEMBL_1448918 (CHEMBL3375685)
IC50
1300±n/a nM
Citation
 Bravo, YTeriete, PDhanya, RPDahl, RLee, PSKiffer-Moreira, TGanji, SRSergienko, ESmith, LHFarquharson, CMillán, JLCosford, ND Design, synthesis and evaluation of benzoisothiazolones as selective inhibitors of PHOSPHO1. Bioorg Med Chem Lett 24:4308-11 (2014)  
Target
Name:
Phosphoethanolamine/phosphocholine phosphatase
Synonyms:
PHOP1_HUMAN phosphatase, orphan 1
Type:
Enzyme Catalytic Domain
Mol. Mass.:
29718.09
Organism:
Homo sapiens (Human)
Description:
Q8TCT1
Residue:
267
  
Inhibitor
Name:
BDBM34737
Synonyms:
2-(4-methylphenyl)-1,2-benzisothiazol-3(2H)-one 2-(p-tolyl)-1,2-benzothiazol-3-one SMR000200989 cid_935415
Type:
Small organic molecule
Emp. Form.:
C14H11NOS
Mol. Mass.:
241.308
SMILES:
Cc1ccc(cc1)-n1sc2ccccc2c1=O
: