Target
Phosphoethanolamine/phosphocholine phosphatase
Ligand
BDBM61910
Substrate
Meas. Tech.
ChEMBL_1448918 (CHEMBL3375685)
IC50
790±n/a nM
Citation
 Bravo, YTeriete, PDhanya, RPDahl, RLee, PSKiffer-Moreira, TGanji, SRSergienko, ESmith, LHFarquharson, CMillán, JLCosford, ND Design, synthesis and evaluation of benzoisothiazolones as selective inhibitors of PHOSPHO1. Bioorg Med Chem Lett 24:4308-11 (2014)  
Target
Name:
Phosphoethanolamine/phosphocholine phosphatase
Synonyms:
PHOP1_HUMAN phosphatase, orphan 1
Type:
Enzyme Catalytic Domain
Mol. Mass.:
29718.09
Organism:
Homo sapiens (Human)
Description:
Q8TCT1
Residue:
267
  
Inhibitor
Name:
BDBM61910
Synonyms:
6-fluoranyl-2-phenyl-1,2-benzothiazol-3-one KUC103671N | cid_1510378
Type:
Small organic molecule
Emp. Form.:
C13H8FNOS
Mol. Mass.:
245.272
SMILES:
Fc1ccc2c(c1)sn(-c1ccccc1)c2=O
: