Target
Phosphoethanolamine/phosphocholine phosphatase
Ligand
BDBM46667
Substrate
Meas. Tech.
ChEMBL_1448918 (CHEMBL3375685)
IC50
940±n/a nM
Citation
 Bravo, YTeriete, PDhanya, RPDahl, RLee, PSKiffer-Moreira, TGanji, SRSergienko, ESmith, LHFarquharson, CMillán, JLCosford, ND Design, synthesis and evaluation of benzoisothiazolones as selective inhibitors of PHOSPHO1. Bioorg Med Chem Lett 24:4308-11 (2014)  
Target
Name:
Phosphoethanolamine/phosphocholine phosphatase
Synonyms:
PHOP1_HUMAN phosphatase, orphan 1
Type:
Enzyme Catalytic Domain
Mol. Mass.:
29718.09
Organism:
Homo sapiens (Human)
Description:
Q8TCT1
Residue:
267
  
Inhibitor
Name:
BDBM46667
Synonyms:
2-phenyl-1,2-benzothiazol-3-one MLS-0107957.0001 cid_164981
Type:
Small organic molecule
Emp. Form.:
C13H9NOS
Mol. Mass.:
227.282
SMILES:
O=c1n(sc2ccccc12)-c1ccccc1
: